Target
Bromodomain-containing protein 2
Ligand
BDBM297146
Substrate
Meas. Tech.
ChEMBL_2169252 (CHEMBL5054311)
IC50
1.4±n/a nM
Citation
 Gavai, AVNorris, DDelucca, GTortolani, DTokarski, JSDodd, DO'Malley, DZhao, YQuesnelle, CGill, PVaccaro, WHuynh, TAhuja, VHan, WCMussari, CHarikrishnan, LKamau, MPoss, MSheriff, SYan, CMarsilio, FMenard, KWen, MLRampulla, RWu, DRLi, JZhang, HLi, PSun, DYip, HTraeger, SCZhang, YMathur, AZhang, HHuang, CYang, ZRanasinghe, AEverlof, GRaghavan, NTye, CKWee, SHunt, JTVite, GWesthouse, RLee, FY Discovery and Preclinical Pharmacology of an Oral Bromodomain and Extra-Terminal (BET) Inhibitor Using Scaffold-Hopping and Structure-Guided Drug Design. J Med Chem 64:14247-14265 (2021)  
Target
Name:
Bromodomain-containing protein 2
Synonyms:
BRD2 Bromodomain and extra-terminal motif (BET) Bromodomain-containing protein 2 (BRD2) RING3
Type:
Protein
Mol. Mass.:
88085.95
Organism:
Homo sapiens (Human)
Description:
P25440
Residue:
801
  
Inhibitor
Name:
BDBM297146
Synonyms:
2-{3-[4-(2H3)Methyl-1-methyl-1H-1,2,3-triazol-5-yl]-5-[(S)-oxan-4-yl(phenyl)methyl]-5H-pyrido[3,2-b]indol-7-yl}propan-2-ol | US10112941, Example 262
Type:
Small organic molecule
Emp. Form.:
C30H33N5O2
Mol. Mass.:
495.6153
SMILES:
Cc1nnn(C)c1-c1cnc2c(c1)n([C@@H](C1CCOCC1)c1ccccc1)c1cc(ccc21)C(C)(C)O
: