Target
Casein kinase I isoform alpha/delta/epsilon/gamma-1/gamma-2
Ligand
BDBM50335638
Substrate
Meas. Tech.
ChEMBL_2170454 (CHEMBL5055513)
IC50
4.0±n/a nM
Citation
 Zhang, JTang, PZou, LZhang, JChen, JYang, CHe, GLiu, BLiu, JChiang, CMWang, GYe, TOuyang, L Discovery of Novel Dual-Target Inhibitor of Bromodomain-Containing Protein 4/Casein Kinase 2 Inducing Apoptosis and Autophagy-Associated Cell Death for Triple-Negative Breast Cancer Therapy. J Med Chem 64:18025-18053 (2021)  
Target
Name:
Casein kinase I isoform alpha/delta/epsilon/gamma-1/gamma-2
Synonyms:
Casein kinase I
Type:
Mol. Mass.:
Description:
ASSAY_ID of ChEMBL is 304706
Components:
This complex has 5 components.
Component 1
Name:
Casein kinase I isoform gamma-1
Synonyms:
CKI-gamma 1 Casein kinase I Casein kinase I isoform gamma-1 | KC1G1_HUMAN
Type:
PROTEIN
Mol. Mass.:
48530.93
Organism:
Homo sapiens (Human)
Description:
ChEMBL_774608
Residue:
422
  
Component 2
Name:
Casein kinase I isoform delta
Synonyms:
CKI-delta CSNK1D Casein kinase I delta Casein kinase I isoform delta (CK1D) KC1D_HUMAN | casein kinases 1 delta (CK1 delta)
Type:
Enzyme
Mol. Mass.:
47356.76
Organism:
Homo sapiens (Human)
Description:
P48730
Residue:
415
  
Component 3
Name:
Casein kinase I isoform epsilon
Synonyms:
Axin-1/Casein kinase I epsilon CKIe Casein kinase 1 epsilon (CK1Ɛ) Casein kinase I isoform epsilon (CK1 epsilon) Casein kinase I isoform epsilon (CK1epsilon) | KC1E_HUMAN
Type:
Protein
Mol. Mass.:
47340.25
Organism:
Homo sapiens (Human)
Description:
P49674
Residue:
416
  
Component 4
Name:
Casein kinase I isoform gamma-2
Synonyms:
CK1G2 Casein kinase I KC1G2_HUMAN
Type:
PROTEIN
Mol. Mass.:
47475.36
Organism:
Homo sapiens (Human)
Description:
ChEMBL_774313
Residue:
415
  
Component 5
Name:
Casein kinase I isoform alpha
Synonyms:
CK1 CSNK1A1 Casein kinase 1 alpha (CK1 alpha) KC1A_HUMAN
Type:
Serine/threonine-protein kinase
Mol. Mass.:
38936.59
Organism:
Homo sapiens (Human)
Description:
P48729
Residue:
337
  
Inhibitor
Name:
BDBM50335638
Synonyms:
5-(3-Chlorophenylamino)benzo[c][2,6]naphthyridine-8-carboxylic acid CHEMBL1230165 US9062043, Table 13, Compound 17 | US9062043, Table 20b, Compound 12
Type:
Small organic molecule
Emp. Form.:
C19H12ClN3O2
Mol. Mass.:
349.77
SMILES:
OC(=O)c1ccc2c(c1)nc(Nc1cccc(Cl)c1)c1ccncc21
: