Target
Sphingosine 1-phosphate receptor 4
Ligand
BDBM50158342
Substrate
Meas. Tech.
ChEMBL_430296 (CHEMBL913922)
IC50
5400±n/a nM
Citation
 Hale, JJLynch, CLNeway, WMills, SGHajdu, RKeohane, CARosenbach, MJMilligan, JAShei, GJParent, SAChrebet, GBergstrom, JCard, DFerrer, MHodder, PStrulovici, BRosen, HMandala, S A rational utilization of high-throughput screening affords selective, orally bioavailable 1-benzyl-3-carboxyazetidine sphingosine-1-phosphate-1 receptor agonists. J Med Chem 47:6662-5 (2004)  
Target
Name:
Sphingosine 1-phosphate receptor 4
Synonyms:
EDG6 S1P receptor 4 S1P4 S1PR4_HUMAN Sphingosine 1-phosphate receptor Edg-6 sphingosine-1-phosphate 4 S1P4
Type:
G Protein-Coupled Receptor (GPCR)
Mol. Mass.:
41647.39
Organism:
Homo sapiens (Human)
Description:
Residue:
384
  
Inhibitor
Name:
BDBM50158342
Synonyms:
1-(4-nonylbenzyl)azetidine-3-carboxylic acid | CHEMBL224623
Type:
Small organic molecule
Emp. Form.:
C20H31NO2
Mol. Mass.:
317.4656
SMILES:
CCCCCCCCCc1ccc(CN2CC(C2)C(O)=O)cc1
: