Target
Sphingosine 1-phosphate receptor 2
Ligand
BDBM50158342
Substrate
Meas. Tech.
ChEMBL_430294 (CHEMBL913920)
IC50
>10000±n/a nM
Citation
 Hale, JJLynch, CLNeway, WMills, SGHajdu, RKeohane, CARosenbach, MJMilligan, JAShei, GJParent, SAChrebet, GBergstrom, JCard, DFerrer, MHodder, PStrulovici, BRosen, HMandala, S A rational utilization of high-throughput screening affords selective, orally bioavailable 1-benzyl-3-carboxyazetidine sphingosine-1-phosphate-1 receptor agonists. J Med Chem 47:6662-5 (2004)  
Target
Name:
Sphingosine 1-phosphate receptor 2
Synonyms:
EDG5 S1PR2 Sphingosine 1-phosphate receptor Sphingosine-1-phosphate receptor 2 | ndothelial differentiation G-protein coupled receptor 5
Type:
G Protein-Coupled Receptor (GPCR)
Mol. Mass.:
38883.16
Organism:
Homo sapiens (Human)
Description:
Membranes isolated from S1P2-transfected CHO cells were used in ligand binding assay.
Residue:
353
  
Inhibitor
Name:
BDBM50158342
Synonyms:
1-(4-nonylbenzyl)azetidine-3-carboxylic acid | CHEMBL224623
Type:
Small organic molecule
Emp. Form.:
C20H31NO2
Mol. Mass.:
317.4656
SMILES:
CCCCCCCCCc1ccc(CN2CC(C2)C(O)=O)cc1
: