Target
Platelet-derived growth factor receptor beta
Ligand
BDBM50588796
Substrate
Meas. Tech.
ChEMBL_2188285 (CHEMBL5100367)
Kd
2.3±n/a nM
Citation
 Chan, SZhang, YWang, JYu, QPeng, XZou, JZhou, LTan, LDuan, YZhou, YHur, HAi, JWang, ZRen, XZhang, ZDing, K Discovery of 3-Aminopyrazole Derivatives as New Potent and Orally Bioavailable AXL Inhibitors. J Med Chem 65:15374-15390 (2022) Target
Name:
Platelet-derived growth factor receptor beta
Synonyms:
Beta-type platelet-derived growth factor receptor CD140b antigen PDGF Receptor Substrate PDGFR PDGFR-1 PDGFRB PGFRB_HUMAN Platelet-derived growth factor receptor 1 Platelet-derived growth factor receptor beta (PDGFR-beta) Platelet-derived growth factor receptor beta (PDGFRbeta) | VHL/PDGFRB
Type:
Enzyme
Mol. Mass.:
123922.25
Organism:
Homo sapiens (Human)
Description:
P09619
Residue:
1106
  
Inhibitor
Name:
BDBM50588796
Synonyms:
CHEMBL5197792
Type:
Small organic molecule
Emp. Form.:
C34H41FN6O5
Mol. Mass.:
632.7249
SMILES:
COc1cc2c(Oc3ccc(Nc4nn(C)cc4C(=O)NC4CCCCC4)cc3F)ccnc2cc1OCCCN1CCOCC1
: