Target
Interstitial collagenase
Ligand
BDBM50063918
Substrate
Meas. Tech.
ChEMBL_2195767 (CHEMBL5108283)
IC50
2200±n/a nM
Citation
 Yahiaoui, SVoos, KHaupenthal, JWichelhaus, TAFrank, DWeizel, LRotter, MBrunst, SKramer, JSProschak, EDucho, CHirsch, AKH -Aryl mercaptoacetamides as potential multi-target inhibitors of metallo-?-lactamases (MBLs) and the virulence factor LasB from  RSC Med Chem 12:1698-1708 (2021) Target
Name:
Interstitial collagenase
Synonyms:
CLG MMP1 Matrix metalloproteinase-1 | Matrix metalloproteinase-1 (MMP-1)
Type:
Enzyme
Mol. Mass.:
54010.26
Organism:
Homo sapiens (Human)
Description:
P03956
Residue:
469
  
Inhibitor
Name:
BDBM50063918
Synonyms:
(2R,3S)-N*4*-Hydroxy-2-isobutyl-N*1*-((S)-1-methylcarbamoyl-2-phenyl-ethyl)-3-(thiophen-2-ylsulfanylmethyl)-succinamide 4-Methyl-2-[1-methyl-2-(thiophen-2-ylsulfanyl)-ethyl]-pentanoic acid (1-methylcarbamoyl-2-phenyl-ethyl)-amide BB-94 N*4*-Hydroxy-2-isobutyl-N*1*-(1-methylcarbamoyl-2-phenyl-ethyl)-3-(thiophen-2-ylsulfanylmethyl)-succinamide
Type:
Small organic molecule
Emp. Form.:
C23H31N3O4S2
Mol. Mass.:
477.64
SMILES:
CNC(=O)[C@H](Cc1ccccc1)NC(=O)[C@H](CC(C)C)[C@H](CSc1cccs1)C(=O)NO
: