Target
Transient receptor potential cation channel subfamily V member 1
Ligand
BDBM20284
Substrate
Meas. Tech.
ChEMBL_306567 (CHEMBL832084)
IC50
4±n/a nM
Citation
 Swanson, DMDubin, AEShah, CNasser, NChang, LDax, SLJetter, MBreitenbucher, JGLiu, CMazur, CLord, BGonzales, LHoey, KRizzolio, MBogenstaetter, MCodd, EELee, DHZhang, SPChaplan, SRCarruthers, NI Identification and biological evaluation of 4-(3-trifluoromethylpyridin-2-yl)piperazine-1-carboxylic acid (5-trifluoromethylpyridin-2-yl)amide, a high affinity TRPV1 (VR1) vanilloid receptor antagonist. J Med Chem 48:1857-72 (2005)  
Target
Name:
Transient receptor potential cation channel subfamily V member 1
Synonyms:
Capsaicin receptor TRPV1_RAT Trpv1 Vanilloid VR1 Vanilloid receptor 1 (VRI/TRPV1) Vanilloid receptor type 1-like (TrpV1/Vr1) Vr1l | osm-9-like TRP channel 1
Type:
Transient Receptor
Mol. Mass.:
94956.12
Organism:
Rattus norvegicus (rat)
Description:
O35433
Residue:
838
  
Inhibitor
Name:
BDBM20284
Synonyms:
CHEMBL391997 Capsazepine N-[2-(4-chlorophenyl)ethyl]-7,8-dihydroxy-2,3,4,5-tetrahydro-1H-2-benzazepine-2-carbothioamide
Type:
Small organic molecule
Emp. Form.:
C19H21ClN2O2S
Mol. Mass.:
376.9
SMILES:
Oc1cc2CCCN(Cc2cc1O)C(=S)NCCc1ccc(Cl)cc1
: