Target
DNA polymerase subunit gamma-1
Ligand
BDBM50591035
Substrate
Meas. Tech.
ChEMBL_2199021 (CHEMBL5111537)
IC50
>100000±n/a nM
Target
Name:
DNA polymerase subunit gamma-1
Synonyms:
DNA Polymerase gamma DNA polymerase (alpha/delta/epsilon) DNA polymerase delta subunit 1 DNA polymerase gamma subunit 1 DNA polymerase kappa DNA polymerase subunit gamma-1 DPOG1_HUMAN Mitochondrial DNA polymerase catalytic subunit POLG1 PolG-alpha
Type:
Enzyme Subunit
Mol. Mass.:
139566.98
Organism:
Homo sapiens (Human)
Description:
Enzyme was purchased from Ulrich Hubscher, University of Zurich-Irchel, Switzerland.
Residue:
1239
  
Inhibitor
Name:
BDBM50591035
Synonyms:
CHEMBL5187422
Type:
Small organic molecule
Emp. Form.:
C22H14F7N5O
Mol. Mass.:
497.3683
SMILES:
Nc1ccc(nn1)C#CCN(C(=O)Cc1ncc(cc1C(F)(F)F)C(F)(F)F)c1ccc(F)cc1
: