Target
Cytochrome P450 1A2
Ligand
BDBM50063995
Substrate
Meas. Tech.
ChEMBL_2203563 (CHEMBL5116271)
IC50
>10000±n/a nM
Citation
 Huang, ZLuo, WXu, DGuo, FYang, MZhu, YShen, LChen, STang, DLi, LLi, YWang, BFranzblau, SGDing, CZ Discovery and preclinical profile of sudapyridine (WX-081), a novel anti-tuberculosis agent. Bioorg Med Chem Lett 71:0 (2022) Target
Name:
Cytochrome P450 1A2
Synonyms:
CP1A2_HUMAN CYPIA2 Cytochrome P(3)450 Cytochrome P450 1A2 (CYP1A2) Cytochrome P450-P3
Type:
Enzyme
Mol. Mass.:
58423.38
Organism:
Homo sapiens (Human)
Description:
P05177
Residue:
516
  
Inhibitor
Name:
BDBM50063995
Synonyms:
Bedaquiline TMC207
Type:
Small organic molecule
Emp. Form.:
C32H31BrN2O2
Mol. Mass.:
555.505
SMILES:
COc1nc2ccc(Br)cc2cc1[C@@H](c1ccccc1)[C@@](O)(CCN(C)C)c1cccc2ccccc12
: