Target
Cytochrome P450 2D6
Ligand
BDBM50063995
Substrate
Meas. Tech.
ChEMBL_2203566 (CHEMBL5116274)
IC50
>10000±n/a nM
Citation
 Huang, ZLuo, WXu, DGuo, FYang, MZhu, YShen, LChen, STang, DLi, LLi, YWang, BFranzblau, SGDing, CZ Discovery and preclinical profile of sudapyridine (WX-081), a novel anti-tuberculosis agent. Bioorg Med Chem Lett 71:0 (2022) Target
Name:
Cytochrome P450 2D6
Synonyms:
CP2D6_HUMAN CYP2DL1 Cytochrome P450 2D6 (CYP2D6) P450-DB1
Type:
Protein
Mol. Mass.:
55774.82
Organism:
Homo sapiens (Human)
Description:
P10635
Residue:
497
  
Inhibitor
Name:
BDBM50063995
Synonyms:
Bedaquiline TMC207
Type:
Small organic molecule
Emp. Form.:
C32H31BrN2O2
Mol. Mass.:
555.505
SMILES:
COc1nc2ccc(Br)cc2cc1[C@@H](c1ccccc1)[C@@](O)(CCN(C)C)c1cccc2ccccc12
: