Target
Prostacyclin receptor
Ligand
BDBM50165944
Substrate
Meas. Tech.
ChEMBL_303131 (CHEMBL828948)
Ki
170±n/a nM
Citation
 Hattori, KTanaka, AFujii, NTakasugi, HTenda, YTomita, MNakazato, SNakano, KKato, YKono, YMurai, HSakane, K Discovery of diphenyloxazole and Ndelta-Z-ornithine derivatives as highly potent and selective human prostaglandin EP(4) receptor antagonists. J Med Chem 48:3103-6 (2005)  
Target
Name:
Prostacyclin receptor
Synonyms:
PGI receptor PRIPR Prostacyclin (IP) Receptor Prostaglandin I Prostaglandin I2 receptor | Prostanoid IP receptor
Type:
G Protein-Coupled Receptor (GPCR)
Mol. Mass.:
40968.22
Organism:
Homo sapiens (Human)
Description:
The membranes prepared from human platelet were used in binding assay.
Residue:
386
  
Inhibitor
Name:
BDBM50165944
Synonyms:
CHEMBL189378 | {3-[(S)-2-(4,5-Diphenyl-oxazol-2-yl)-cyclohex-2-enylmethyl]-phenyl}-acetic acid
Type:
Small organic molecule
Emp. Form.:
C30H27NO3
Mol. Mass.:
449.5403
SMILES:
OC(=O)Cc1cccc(C[C@@H]2CCCC=C2c2nc(c(o2)-c2ccccc2)-c2ccccc2)c1
: