Target
Prostaglandin E2 receptor EP4 subtype
Ligand
BDBM50165945
Substrate
Meas. Tech.
ChEMBL_303062 (CHEMBL828888)
Ki
0.68±n/a nM
Citation
 Hattori, KTanaka, AFujii, NTakasugi, HTenda, YTomita, MNakazato, SNakano, KKato, YKono, YMurai, HSakane, K Discovery of diphenyloxazole and Ndelta-Z-ornithine derivatives as highly potent and selective human prostaglandin EP(4) receptor antagonists. J Med Chem 48:3103-6 (2005)  
Target
Name:
Prostaglandin E2 receptor EP4 subtype
Synonyms:
PE2R4_HUMAN PGE2 receptor EP4 subtype PTGER4 Prostanoid EP4 receptor
Type:
Enzyme
Mol. Mass.:
53134.53
Organism:
Homo sapiens (Human)
Description:
P35408
Residue:
488
  
Inhibitor
Name:
BDBM50165945
Synonyms:
CHEMBL371394 | N-Benzyloxy-3-[(S)-2-(4,5-diphenyl-oxazol-2-yl)-cyclohex-2-enylmethyl]-benzamide
Type:
Small organic molecule
Emp. Form.:
C36H32N2O3
Mol. Mass.:
540.6509
SMILES:
O=C(NOCc1ccccc1)c1cccc(C[C@@H]2CCCC=C2c2nc(c(o2)-c2ccccc2)-c2ccccc2)c1
: