Target
Prostaglandin E2 receptor EP4 subtype
Ligand
BDBM50165949
Substrate
Meas. Tech.
ChEMBL_302462 (CHEMBL826328)
Ki
0.74±n/a nM
Citation
 Hattori, KTanaka, AFujii, NTakasugi, HTenda, YTomita, MNakazato, SNakano, KKato, YKono, YMurai, HSakane, K Discovery of diphenyloxazole and Ndelta-Z-ornithine derivatives as highly potent and selective human prostaglandin EP(4) receptor antagonists. J Med Chem 48:3103-6 (2005)  
Target
Name:
Prostaglandin E2 receptor EP4 subtype
Synonyms:
PE2R4_RAT Ptger4
Type:
PROTEIN
Mol. Mass.:
53381.95
Organism:
Rattus norvegicus
Description:
ChEMBL_1290039
Residue:
488
  
Inhibitor
Name:
BDBM50165949
Synonyms:
C-Phenyl-N-{3-[2-((S)-5-phenyl-4-phenyl-oxazol-2-yl)-cyclohex-2-enylmethyl]-benzoyl}-methanesulfonamide | CHEMBL191638
Type:
Small organic molecule
Emp. Form.:
C36H32N2O4S
Mol. Mass.:
588.715
SMILES:
O=C(NS(=O)(=O)Cc1ccccc1)c1cccc(C[C@@H]2CCCC=C2c2nc(c(o2)-c2ccccc2)-c2ccccc2)c1
: