Target
Histone-lysine N-methyltransferase EZH2
Ligand
BDBM155255
Substrate
Meas. Tech.
ChEMBL_2210982 (CHEMBL5123931)
IC50
8.4±n/a nM
Citation
 Xia, JLi, JTian, LRen, XLiu, CLiang, C Targeting Enhancer of Zeste Homolog 2 for the Treatment of Hematological Malignancies and Solid Tumors: Candidate Structure-Activity Relationships Insights and Evolution Prospects. J Med Chem 65:7016-7043 (2022) Target
Name:
Histone-lysine N-methyltransferase EZH2
Synonyms:
ENX-1 EZH2_HUMAN Histone-lysine N-methyltransferase EZH2 Lysine N-methyltransferase 6
Type:
Protein
Mol. Mass.:
85367.84
Organism:
Homo sapiens (Human)
Description:
Q15910
Residue:
746
  
Inhibitor
Name:
BDBM155255
Synonyms:
US10098888, Compound 105 US9006242, 105
Type:
Small organic molecule
Emp. Form.:
C31H42N4O3
Mol. Mass.:
518.6902
SMILES:
CCN(C1CCOCC1)c1cc(cc(C(=O)NCc2c(C)cc(C)[nH]c2=O)c1C)C#CC1CCN(C)CC1
: