Target
Adenosine receptor A1
Ligand
BDBM50594655
Substrate
Meas. Tech.
ChEMBL_2213721 (CHEMBL5126853)
Ki
0.051000±n/a nM
Citation
 Saini, APatel, RGaba, SSingh, GGupta, GDMonga, V Adenosine receptor antagonists: Recent advances and therapeutic perspective. Eur J Med Chem 227:0 (2022) Target
Name:
Adenosine receptor A1
Synonyms:
A1 adenosine receptor (hA1) AA1R_HUMAN ADORA1 Adenosine A1-receptor Adenosine receptor A1 (hA1) | Adenosine transporter (AdT)
Type:
G Protein-Coupled Receptor (GPCR)
Mol. Mass.:
36520.92
Organism:
Homo sapiens (Human)
Description:
P30542
Residue:
326
  
Inhibitor
Name:
BDBM50594655
Synonyms:
CHEMBL5177144
Type:
Small organic molecule
Emp. Form.:
C11H7N5O2
Mol. Mass.:
241.2056
SMILES:
NC1=C(C#N)C(=O)n2nc(nc2C1)-c1ccco1
: