Target
Melanin-concentrating hormone receptor 1
Ligand
BDBM50168799
Substrate
Meas. Tech.
ChEMBL_302713 (CHEMBL839584)
Ki
4.3±n/a nM
Citation
 Guo, THunter, RCGu, HRokosz, LLStauffer, TMHobbs, DW Discovery and SAR of 4-amino-2-biarylbutylurea MCH 1 receptor antagonists through solid-phase parallel synthesis. Bioorg Med Chem Lett 15:3691-5 (2005)  
Target
Name:
Melanin-concentrating hormone receptor 1
Synonyms:
G-protein coupled receptor 24 MCH receptor 1 MCH-R1 MCHR-1 MCHR1_HUMAN Melanin-Concentrating Hormone Receptor 1 (MCH1R) Melanin-concentrating hormone receptor 1 (MCH-1) Melanin-concentrating hormone receptor 1 (MCHR-1) SLC-1 Somatostatin receptor-like protein
Type:
G Protein-Coupled Receptor (GPCR)
Mol. Mass.:
45976.27
Organism:
Homo sapiens (Human)
Description:
Membranes from CHO-K1 cells stably expressing human MCH1R were used in assays.
Residue:
422
  
Inhibitor
Name:
BDBM50168799
Synonyms:
1-[2-(3'-Cyano-biphenyl-4-yl)-4-ethylamino-butyl]-3-(3,5-dichloro-phenyl)-urea | CHEMBL179425
Type:
Small organic molecule
Emp. Form.:
C26H26Cl2N4O
Mol. Mass.:
481.417
SMILES:
CCNCCC(CNC(=O)Nc1cc(Cl)cc(Cl)c1)c1ccc(cc1)-c1cccc(c1)C#N
: