Target
Melanin-concentrating hormone receptor 1
Ligand
BDBM50168823
Substrate
Meas. Tech.
ChEMBL_302713 (CHEMBL839584)
Ki
2.4±n/a nM
Citation
 Guo, THunter, RCGu, HRokosz, LLStauffer, TMHobbs, DW Discovery and SAR of 4-amino-2-biarylbutylurea MCH 1 receptor antagonists through solid-phase parallel synthesis. Bioorg Med Chem Lett 15:3691-5 (2005)  
Target
Name:
Melanin-concentrating hormone receptor 1
Synonyms:
G-protein coupled receptor 24 MCH receptor 1 MCH-R1 MCHR-1 MCHR1_HUMAN Melanin-Concentrating Hormone Receptor 1 (MCH1R) Melanin-concentrating hormone receptor 1 (MCH-1) Melanin-concentrating hormone receptor 1 (MCHR-1) SLC-1 Somatostatin receptor-like protein
Type:
G Protein-Coupled Receptor (GPCR)
Mol. Mass.:
45976.27
Organism:
Homo sapiens (Human)
Description:
Membranes from CHO-K1 cells stably expressing human MCH1R were used in assays.
Residue:
422
  
Inhibitor
Name:
BDBM50168823
Synonyms:
1-[2-(3'-Cyano-biphenyl-4-yl)-4-dimethylamino-butyl]-3-phenyl-urea | CHEMBL176548
Type:
Small organic molecule
Emp. Form.:
C26H28N4O
Mol. Mass.:
412.5267
SMILES:
CN(C)CCC(CNC(=O)Nc1ccccc1)c1ccc(cc1)-c1cccc(c1)C#N
: