Target
Melanin-concentrating hormone receptor 1
Ligand
BDBM50169391
Substrate
Meas. Tech.
ChEMBL_303523 (CHEMBL839637)
Ki
3.1±n/a nM
Citation
 Guo, TShao, YQian, GRokosz, LLStauffer, TMHunter, RCBabu, SDGu, HHobbs, DW Discovery and SAR of biaryl piperidine MCH1 receptor antagonists through solid-phase encoded combinatorial synthesis. Bioorg Med Chem Lett 15:3696-700 (2005)  
Target
Name:
Melanin-concentrating hormone receptor 1
Synonyms:
G-protein coupled receptor 24 MCH receptor 1 MCH-R1 MCHR-1 MCHR1_HUMAN Melanin-Concentrating Hormone Receptor 1 (MCH1R) Melanin-concentrating hormone receptor 1 (MCH-1) Melanin-concentrating hormone receptor 1 (MCHR-1) SLC-1 Somatostatin receptor-like protein
Type:
G Protein-Coupled Receptor (GPCR)
Mol. Mass.:
45976.27
Organism:
Homo sapiens (Human)
Description:
Membranes from CHO-K1 cells stably expressing human MCH1R were used in assays.
Residue:
422
  
Inhibitor
Name:
BDBM50169391
Synonyms:
1-(3,5-Dichloro-phenyl)-3-[1-methyl-4-(4-pyridin-3-yl-phenyl)-piperidin-4-ylmethyl]-urea | CHEMBL367156
Type:
Small organic molecule
Emp. Form.:
C25H26Cl2N4O
Mol. Mass.:
469.406
SMILES:
CN1CCC(CNC(=O)Nc2cc(Cl)cc(Cl)c2)(CC1)c1ccc(cc1)-c1cccnc1
: