Target
Potassium voltage-gated channel subfamily H member 2
Ligand
BDBM50595354
Substrate
Meas. Tech.
ChEMBL_2216379 (CHEMBL5129511)
EC50
>10000±n/a nM
Citation
 Lee, DKang, JALim, CBae, SChoi, JPark, MKim, YCCho, YPark, SGSeo, J Entry inhibition of hepatitis B virus using cyclosporin O derivatives with peptoid side chain incorporation. Bioorg Med Chem 68:0 (2022) Target
Name:
Potassium voltage-gated channel subfamily H member 2
Synonyms:
1,3-beta-glucan synthase component GLS2 ERG Eag-related protein 1 Ether-a-go-go-related gene (HERG) Ether-a-go-go-related gene potassium channel 1 Ether-a-go-go-related gene potassium channel 1 (hERG1) Ether-a-go-go-related protein 1 H-ERG KCNH2 Potassium voltage-gated channel subfamily H member 2 (hERG) Voltage-gated potassium channel subunit Kv11.1 hERG Potassium Channel 1 | putative potassium channel subunit
Type:
Multi-pass membrane protein
Mol. Mass.:
126672.65
Organism:
Homo sapiens (Human)
Description:
Q12809
Residue:
1159
  
Inhibitor
Name:
BDBM50595354
Synonyms:
CHEMBL5186371
Type:
Small organic molecule
Emp. Form.:
C60H108N12O13
Mol. Mass.:
1205.5721
SMILES:
CCC[C@@H]1NC(=O)[C@H](CC(C)C)N(C)C(=O)[C@H](CC(C)C)N(C)C(=O)CN(CCO)C(=O)[C@H](CC(C)C)N(C)C(=O)[C@@H](C)NC(=O)[C@@H](CCC(N)=O)NC(=O)[C@H](CC(C)C)N(C)C(=O)[C@@H](NC(=O)[C@H](CC(C)C)N(C)C(=O)CN(C)C1=O)C(C)C
: