Target
Transient receptor potential cation channel subfamily V member 1
Ligand
BDBM20284
Substrate
Meas. Tech.
ChEMBL_306882 (CHEMBL828688)
IC50
56±n/a nM
Citation
 Appendino, GDaddario, NMinassi, AMoriello, ASDe Petrocellis, LDi Marzo, V The taming of capsaicin. Reversal of the vanilloid activity of N-acylvanillamines by aromatic iodination. J Med Chem 48:4663-9 (2005)  
Target
Name:
Transient receptor potential cation channel subfamily V member 1
Synonyms:
Capsaicin receptor Osm-9-like TRP channel 1 TRPV1_HUMAN Transient receptor potential cation channel subfamily V member 1 (TRPV1) Transient receptor potential cation channel subfamily V member 1(TRPV1) Vanilloid VR1 Vanilloid receptor 1 Vanilloid receptor 1 (VRI/TRPV1)
Type:
Protein
Mol. Mass.:
94960.75
Organism:
Homo sapiens (Human)
Description:
Q8NER1
Residue:
839
  
Inhibitor
Name:
BDBM20284
Synonyms:
CHEMBL391997 Capsazepine N-[2-(4-chlorophenyl)ethyl]-7,8-dihydroxy-2,3,4,5-tetrahydro-1H-2-benzazepine-2-carbothioamide
Type:
Small organic molecule
Emp. Form.:
C19H21ClN2O2S
Mol. Mass.:
376.9
SMILES:
Oc1cc2CCCN(Cc2cc1O)C(=S)NCCc1ccc(Cl)cc1
: