Target
Alpha-1D adrenergic receptor
Ligand
BDBM50173164
Substrate
Meas. Tech.
ChEMBL_320870 (CHEMBL884795)
Ki
50±n/a nM
Citation
 Hong, SSBavadekar, SALee, SIPatil, PNLalchandani, SGFeller, DRMiller, DD Bioisosteric phentolamine analogs as potent alpha-adrenergic antagonists. Bioorg Med Chem Lett 15:4691-5 (2005)  
Target
Name:
Alpha-1D adrenergic receptor
Synonyms:
ADA1D_HUMAN ADRA1D Adrenergic receptor alpha Alpha 1D-adrenoreceptor Alpha-1D adrenoceptor adrenergic Alpha1D
Type:
Enzyme Catalytic Domain
Mol. Mass.:
60485.82
Organism:
Homo sapiens (Human)
Description:
adrenergic Alpha1D ADRA1D HUMAN::P25100
Residue:
572
  
Inhibitor
Name:
BDBM50173164
Synonyms:
3-[N'-(4,5-Dihydro-1H-imidazol-2-yl)-N-p-tolyl-hydrazino]-phenol | CHEMBL194849
Type:
Small organic molecule
Emp. Form.:
C16H18N4O
Mol. Mass.:
282.3403
SMILES:
[#6]-c1ccc(cc1)-[#7](\[#7]=[#6]-1/[#7]-[#6]-[#6]-[#7]-1)-c1cccc(-[#8])c1
: