Target
Alpha-1A adrenergic receptor
Ligand
BDBM50173165
Substrate
Meas. Tech.
ChEMBL_320861 (CHEMBL884786)
Ki
5.3±n/a nM
Citation
 Hong, SSBavadekar, SALee, SIPatil, PNLalchandani, SGFeller, DRMiller, DD Bioisosteric phentolamine analogs as potent alpha-adrenergic antagonists. Bioorg Med Chem Lett 15:4691-5 (2005)  
Target
Name:
Alpha-1A adrenergic receptor
Synonyms:
ADA1A_HUMAN ADRA1C Alpha 1A-adrenoceptor Alpha adrenergic receptor 1a Alpha-adrenergic receptor 1c adrenergic Alpha1 | adrenergic Alpha1C
Type:
Cell-surface receptors
Mol. Mass.:
51511.67
Organism:
Homo sapiens (Human)
Description:
P35348
Residue:
466
  
Inhibitor
Name:
BDBM50173165
Synonyms:
CHEMBL194323 | N'-(4,5-Dihydro-oxazol-2-yl)-N-(3-methoxy-phenyl)-N-p-tolyl-hydrazine
Type:
Small organic molecule
Emp. Form.:
C17H19N3O2
Mol. Mass.:
297.3517
SMILES:
COc1cccc(c1)N(N=C1NCCO1)c1ccc(C)cc1
: