Target
Procathepsin L
Ligand
BDBM50240981
Substrate
Meas. Tech.
ChEMBL_321237 (CHEMBL881772)
IC50
2274.0±n/a nM
Citation
 Black, WCBayly, CIDavis, DEDesmarais, SFalgueyret, JPLéger, SLi, CSMassé, FMcKay, DJPalmer, JTPercival, MDRobichaud, JTsou, NZamboni, R Trifluoroethylamines as amide isosteres in inhibitors of cathepsin K. Bioorg Med Chem Lett 15:4741-4 (2005)  
Target
Name:
Procathepsin L
Synonyms:
CATL1_HUMAN CTSL CTSL1 Cathepsin L Cathepsin L1 heavy chain MEP cathepsin L preproprotein
Type:
Enzyme
Mol. Mass.:
37557.19
Organism:
Homo sapiens (Human)
Description:
Purchased from Calbiochem (San Diego, CA).
Residue:
333
  
Inhibitor
Name:
BDBM50240981
Synonyms:
4'-piperazin-1-yl-biphenyl-4-carboxylic acid [1-(cyanomethyl-carbamoyl)-cyclohexyl]-amide | CHEMBL371133
Type:
Small organic molecule
Emp. Form.:
C26H31N5O2
Mol. Mass.:
445.5566
SMILES:
O=C(NC1(CCCCC1)C(=O)NCC#N)c1ccc(cc1)-c1ccc(cc1)N1CCNCC1
: