Target
Prostaglandin D2 receptor 2
Ligand
BDBM17638
Substrate
Meas. Tech.
ChEMBL_320913 (CHEMBL881340)
Ki
50±n/a nM
Citation
 Armer, REAshton, MRBoyd, EABrennan, CJBrookfield, FAGazi, LGyles, SLHay, PAHunter, MGMiddlemiss, DWhittaker, MXue, LPettipher, R Indole-3-acetic acid antagonists of the prostaglandin D2 receptor CRTH2. J Med Chem 48:6174-7 (2005)  
Target
Name:
Prostaglandin D2 receptor 2
Synonyms:
CD_antigen=CD294 Chemoattractant Receptor-homologous molecule expressed on T-helper type 2 cells (CRTH2) Chemoattractant receptor-homologous molecule expressed on Th2 cells (CRTH2) G protein-coupled receptor 44 GPR44 PTGDR2 Prostaglandin D2 receptor 2 | Prostaglandin D2 receptor 2 (PGD2)
Type:
Enzyme
Mol. Mass.:
43295.45
Organism:
Homo sapiens (Human)
Description:
Q9Y5Y4
Residue:
395
  
Inhibitor
Name:
BDBM17638
Synonyms:
2-{1-[(4-chlorophenyl)carbonyl]-5-methoxy-2-methyl-1H-indol-3-yl}acetic acid Indocin US11478464, Compound Indomethacin US9271961, Indomethacin | indometacin
Type:
Small organic molecule
Emp. Form.:
C19H16ClNO4
Mol. Mass.:
357.788
SMILES:
COc1ccc2n(C(=O)c3ccc(Cl)cc3)c(C)c(CC(O)=O)c2c1
: