Target
Histone-lysine N-methyltransferase EZH2
Ligand
BDBM50075071
Substrate
Meas. Tech.
ChEMBL_2224729 (CHEMBL5138242)
IC50
<10.0±n/a nM
Citation
 Talukdar, AMukherjee, ABhattacharya, D Fascinating Transformation of SAM-Competitive Protein Methyltransferase Inhibitors from Nucleoside Analogues to Non-Nucleoside Analogues. J Med Chem 65:1662-1684 (2022) Target
Name:
Histone-lysine N-methyltransferase EZH2
Synonyms:
ENX-1 EZH2_HUMAN Histone-lysine N-methyltransferase EZH2 Lysine N-methyltransferase 6
Type:
Protein
Mol. Mass.:
85367.84
Organism:
Homo sapiens (Human)
Description:
Q15910
Residue:
746
  
Inhibitor
Name:
BDBM50075071
Synonyms:
CHEMBL3414619
Type:
Small organic molecule
Emp. Form.:
C33H43N7O2
Mol. Mass.:
569.7402
SMILES:
CCCc1cc(C)[nH]c(=O)c1CNC(=O)c1cc(cc2n(ncc12)C(C)C)-c1ccc(nc1)N1CCN(CC1)C(C)C
: