Target
Fructose-bisphosphate aldolase class 2
Ligand
BDBM50167777
Substrate
Meas. Tech.
ChEMBL_326983 (CHEMBL868742)
Ki
10±n/a nM
Citation
 Gavalda, SBraga, RDax, CVigroux, ABlonski, C N-Sulfonyl hydroxamate derivatives as inhibitors of class II fructose-1,6-diphosphate aldolase. Bioorg Med Chem Lett 15:5375-7 (2005)  
Target
Name:
Fructose-bisphosphate aldolase class 2
Synonyms:
ALF_ECOLI fbaA | fda
Type:
PROTEIN
Mol. Mass.:
39141.25
Organism:
Escherichia coli (strain K12)
Description:
ChEMBL_326983
Residue:
359
  
Inhibitor
Name:
BDBM50167777
Synonyms:
2-(hydroxyamino)-2-oxoethyl dihydrogen phosphate Phosphoglycolohydroxamic Acid
Type:
Small organic molecule
Emp. Form.:
C2H6NO6P
Mol. Mass.:
171.0459
SMILES:
ONC(=O)COP(O)(O)=O
: