Target
Protein polybromo-1
Ligand
BDBM394583
Substrate
Meas. Tech.
ChEMBL_2228699 (CHEMBL5142212)
IC50
8.9±n/a nM
Citation
 Taylor, AMBailey, CBelmont, LDCampbell, RCantone, NCôté, ACrawford, TDCummings, RDeMent, KDuplessis, MFlynn, MGood, ACHuang, HRJoshi, SLeblanc, YMurray, JNasveschuk, CGNeiss, APoy, FRomero, FASandy, PTang, YTsui, VZawadzke, LSims, RJAudia, JEBellon, SFMagnuson, SRAlbrecht, BKCochran, AG GNE-064: A Potent, Selective, and Orally Bioavailable Chemical Probe for the Bromodomains of SMARCA2 and SMARCA4 and the Fifth Bromodomain of PBRM1. J Med Chem 65:11177-11186 (2022) Target
Name:
Protein polybromo-1
Synonyms:
BAF180 PB1 PBRM1 hPB1
Type:
PROTEIN
Mol. Mass.:
192953.62
Organism:
Homo sapiens (Human)
Description:
ChEMBL_104264
Residue:
1689
  
Inhibitor
Name:
BDBM394583
Synonyms:
2-(6-amino-5-phenylpyridazin-3-yl)phenol | US10308614, Example 186
Type:
Small organic molecule
Emp. Form.:
C16H13N3O
Mol. Mass.:
263.2939
SMILES:
Nc1nnc(cc1-c1ccccc1)-c1ccccc1O
: