Target
Lysophosphatidic acid receptor 1
Ligand
BDBM50176398
Substrate
Meas. Tech.
ChEMBL_333862 (CHEMBL864091)
Ki
139±n/a nM
Citation
 Durgam, GGTsukahara, RMakarova, NWalker, MDFujiwara, YPigg, KRBaker, DLSardar, VMParrill, ALTigyi, GMiller, DD Synthesis and pharmacological evaluation of second-generation phosphatidic acid derivatives as lysophosphatidic acid receptor ligands. Bioorg Med Chem Lett 16:633-40 (2005)  
Target
Name:
Lysophosphatidic acid receptor 1
Synonyms:
EDG2 LPA-1 LPAR1 Lysophosphatidic acid receptor 1 (LPA1) | Lysophosphatidic acid receptor Edg-2
Type:
Enzyme
Mol. Mass.:
41120.55
Organism:
Homo sapiens (Human)
Description:
Q92633
Residue:
364
  
Inhibitor
Name:
BDBM50176398
Synonyms:
(S)-O-2,3-bis(octyloxy)propyl O,O-dihydrogen phosphorothioate | CHEMBL427017
Type:
Small organic molecule
Emp. Form.:
C19H41O5PS
Mol. Mass.:
412.565
SMILES:
CCCCCCCCOC[C@@H](COP(O)(O)=S)OCCCCCCCC
: