Target
Metabotropic glutamate receptor 5
Ligand
BDBM50177063
Substrate
Meas. Tech.
ChEMBL_430992 (CHEMBL916420)
IC50
1250±n/a nM
Citation
 Zheng, GZBhatia, PDaanen, JKolasa, TPatel, MLatshaw, SEl Kouhen, OFChang, RUchic, MEMiller, LNakane, MLehto, SGHonore, MPMoreland, RBBrioni, JDStewart, AO Structure-activity relationship of triazafluorenone derivatives as potent and selective mGluR1 antagonists. J Med Chem 48:7374-88 (2005)  
Target
Name:
Metabotropic glutamate receptor 5
Synonyms:
GPRC1E GRM5_HUMAN metabotropic glutamate 5 | metabotropic glutamate 5a
Type:
Enzyme
Mol. Mass.:
132484.72
Organism:
Homo sapiens (Human)
Description:
Residue:
1212
  
Inhibitor
Name:
BDBM50177063
Synonyms:
3-(4-Bromo-phenyl)-9-dimethylamino-3H-pyrido[3',2':4,5]thieno[3,2-d]pyrimidin-4-one CHEMBL225590
Type:
Small organic molecule
Emp. Form.:
C17H13BrN4OS
Mol. Mass.:
401.28
SMILES:
CN(C)c1ccnc2sc3c(ncn(-c4ccc(Br)cc4)c3=O)c12
: