Target
Substance-P receptor
Ligand
BDBM50178561
Substrate
Meas. Tech.
ChEMBL_337893 (CHEMBL868375)
Ki
1±n/a nM
Citation
 Hoffmann, TBös, MStadler, HSchnider, PHunkeler, WGodel, TGalley, GBallard, TMHiggins, GAPoli, SMSleight, AJ Design and synthesis of a novel, achiral class of highly potent and selective, orally active neurokinin-1 receptor antagonists. Bioorg Med Chem Lett 16:1362-5 (2006)  
Target
Name:
Substance-P receptor
Synonyms:
NK-1 receptor NK1 Receptor NK1R_HUMAN Neurokinin-1 (NK-1) SPR TACR1 Tachykinin receptor 1 (NK1) | tachykinin
Type:
G Protein-Coupled Receptor (GPCR)
Mol. Mass.:
46254.43
Organism:
Homo sapiens (Human)
Description:
P25103
Residue:
407
  
Inhibitor
Name:
BDBM50178561
Synonyms:
2-(3,5-bis(trifluoromethyl)phenyl)-N,2-dimethyl-N-(6-morpholino-4-o-tolylpyridin-3-yl)propanamide | CHEMBL204694
Type:
Small organic molecule
Emp. Form.:
C29H29F6N3O2
Mol. Mass.:
565.5499
SMILES:
CN(C(=O)C(C)(C)c1cc(cc(c1)C(F)(F)F)C(F)(F)F)c1cnc(cc1-c1ccccc1C)N1CCOCC1
: