Target
Substance-P receptor
Ligand
BDBM50178581
Substrate
Meas. Tech.
ChEMBL_337893 (CHEMBL868375)
Ki
1.4±n/a nM
Citation
 Hoffmann, TBös, MStadler, HSchnider, PHunkeler, WGodel, TGalley, GBallard, TMHiggins, GAPoli, SMSleight, AJ Design and synthesis of a novel, achiral class of highly potent and selective, orally active neurokinin-1 receptor antagonists. Bioorg Med Chem Lett 16:1362-5 (2006)  
Target
Name:
Substance-P receptor
Synonyms:
NK-1 receptor NK1 Receptor NK1R_HUMAN Neurokinin-1 (NK-1) SPR TACR1 Tachykinin receptor 1 (NK1) | tachykinin
Type:
G Protein-Coupled Receptor (GPCR)
Mol. Mass.:
46254.43
Organism:
Homo sapiens (Human)
Description:
P25103
Residue:
407
  
Inhibitor
Name:
BDBM50178581
Synonyms:
2'-methyl-5-(4-methyl-piperazin-1-yl)-biphenyl-2-carboxylic acid (3,5-bis-trifluoromethyl-benzyl)-methyl-amide | CHEMBL206171
Type:
Small organic molecule
Emp. Form.:
C29H29F6N3O
Mol. Mass.:
549.5505
SMILES:
CN(Cc1cc(cc(c1)C(F)(F)F)C(F)(F)F)C(=O)c1ccc(cc1-c1ccccc1C)N1CCN(C)CC1
: