Target
Tyrosinase
Ligand
BDBM7462
Substrate
Meas. Tech.
ChEMBL_2233522 (CHEMBL5147294)
IC50
65110±n/a nM
Citation
 ?mamo?lu, RKoç, EK?sa, D Polyphenolic compounds: Synthesis, assessment of antimicrobial effect and enzymes inhibition against important medicinal enzymes with computational details. Bioorg Med Chem Lett 65:0 (2022) Target
Name:
Tyrosinase
Synonyms:
LB24-AB SK29-AB TYRO_HUMAN | Tumor rejection antigen AB
Type:
Protein
Mol. Mass.:
60388.08
Organism:
Homo sapiens (Human)
Description:
P14679
Residue:
529
  
Inhibitor
Name:
BDBM7462
Synonyms:
3,5,7-trihydroxy-2-(4-hydroxyphenyl)-4H-chromen-4-one CHEMBL150 Kaempferol (Kmp) kaempferol
Type:
Small organic molecule
Emp. Form.:
C15H10O6
Mol. Mass.:
286.2363
SMILES:
Oc1ccc(cc1)-c1oc2cc(O)cc(O)c2c(=O)c1O
: