Target
Sodium channel protein type 5 subunit alpha
Ligand
BDBM50017659
Substrate
Meas. Tech.
ChEMBL_2233932 (CHEMBL5147704)
IC50
650±n/a nM
Citation
 Patel, MVPeltier, HMMatulenko, MAKoenig, JRC Scanio, MJGum, RJEl-Kouhen, OFFricano, MMLundgaard, GLNeelands, TZhang, XFZhan, CPai, MGhoreishi-Haack, NHudzik, TGintant, GMartin, RMcGaraughty, SXu, JBow, DKalvass, JCKym, PRDeGoey, DAKort, ME Discovery of (R)-(3-fluoropyrrolidin-1-yl)(6-((5-(trifluoromethyl)pyridin-2-yl)oxy)quinolin-2-yl)methanone (ABBV-318) and analogs as small molecule Na Bioorg Med Chem 63:0 (2022) Target
Name:
Sodium channel protein type 5 subunit alpha
Synonyms:
HH1 SCN5A_HUMAN Sodium channel protein type 5 subunit alpha/beta-1/beta-2 Voltage-gated sodium channel subunit alpha Nav1.5
Type:
Enzyme
Mol. Mass.:
226908.60
Organism:
Homo sapiens (Human)
Description:
Q14524
Residue:
2016
  
Inhibitor
Name:
BDBM50017659
Synonyms:
2-(Dimethylamino)ethyl p-(butylamino)benzoate CHEMBL698 TETRACAINE | p-Butylaminobenzoyl-2-dimethylaminoethanol
Type:
Small organic molecule
Emp. Form.:
C15H24N2O2
Mol. Mass.:
264.3633
SMILES:
CCCCNc1ccc(cc1)C(=O)OCCN(C)C
: