Target
Retinoic acid receptor RXR-beta
Ligand
BDBM31892
Substrate
Meas. Tech.
ChEMBL_2235595 (CHEMBL5149367)
EC50
6.0±n/a nM
Citation
 Shim, SKrishnaiah, MSankham, MRKim, ILee, YShin, IOh, ARLee, HJVu, TNLPark, JChoi, SPark, SKwon, YFang, SKim, DK Discovery of ( J Med Chem 65:9974-10000 (2022) Target
Name:
Retinoic acid receptor RXR-beta
Synonyms:
NR2B2 RXRB Retinoic acid receptor RXR-beta Retinoid receptor
Type:
PROTEIN
Mol. Mass.:
56932.89
Organism:
Homo sapiens (Human)
Description:
ChEMBL_39045
Residue:
533
  
Inhibitor
Name:
BDBM31892
Synonyms:
9-cis retinoic acid CHEMBL705 alitretinoin
Type:
Small organic molecule
Emp. Form.:
C20H28O2
Mol. Mass.:
300.4351
SMILES:
C\C(\C=C\C1=C(C)CCCC1(C)C)=C\C=C\C(\C)=C\C(O)=O
: