Target
Methionine aminopeptidase
Ligand
BDBM50241293
Substrate
Meas. Tech.
ChEMBL_329657 (CHEMBL865844)
IC50
>10000±n/a nM
Citation
 Schiffmann, RNeugebauer, AKlein, CD Metal-mediated inhibition of Escherichia coli methionine aminopeptidase: structure-activity relationships and development of a novel scoring function for metal-ligand interactions. J Med Chem 49:511-22 (2006)  
Target
Name:
Methionine aminopeptidase
Synonyms:
EcMetAP Methionine Aminopeptidase (MAP) Peptidase M | map
Type:
Enzyme
Mol. Mass.:
29326.96
Organism:
Escherichia coli (strain K12)
Description:
Full-length untagged EcMAP was expressed in E. coli.
Residue:
264
  
Inhibitor
Name:
BDBM50241293
Synonyms:
(5-Propylsulfanyl-1H-benzoimidazol-2-yl)-carbamic acid methyl ester Albenza SK&F-62979 methyl 6-(propylthio)-1H-benzo[d]imidazol-2-ylcarbamate
Type:
Small organic molecule
Emp. Form.:
C12H15N3O2S
Mol. Mass.:
265.331
SMILES:
CCCSc1ccc2nc(NC(=O)OC)[nH]c2c1
: