Target
Group 10 secretory phospholipase A2
Ligand
BDBM50601469
Substrate
Meas. Tech.
ChEMBL_2237095 (CHEMBL5150991)
IC50
100±n/a nM
Citation
 Robello, MBarresi, EBaglini, ESalerno, STaliani, SSettimo, FD The Alpha Keto Amide Moiety as a Privileged Motif in Medicinal Chemistry: Current Insights and Emerging Opportunities. J Med Chem 64:3508-3545 (2021) Target
Name:
Group 10 secretory phospholipase A2
Synonyms:
Group X secretory phospholipase A2 PLA2G10
Type:
PROTEIN
Mol. Mass.:
18153.11
Organism:
Homo sapiens (Human)
Description:
ChEMBL_1442449
Residue:
165
  
Inhibitor
Name:
BDBM50601469
Synonyms:
CHEMBL5172164
Type:
Small organic molecule
Emp. Form.:
C26H22N2O5
Mol. Mass.:
442.4633
SMILES:
Cc1c(Cc2ccccc2-c2ccccc2)n2cccc(OCC(O)=O)c2c1C(=O)C(N)=O
: