Target
RNA-directed RNA polymerase
Ligand
BDBM50181580
Substrate
Meas. Tech.
ChEMBL_330651 (CHEMBL867029)
IC50
48±n/a nM
Citation
 Tedesco, RShaw, ANBambal, RChai, DConcha, NODarcy, MGDhanak, DFitch, DMGates, AGerhardt, WGHalegoua, DLHan, CHofmann, GAJohnston, VKKaura, ACLiu, NKeenan, RMLin-Goerke, JSarisky, RTWiggall, KJZimmerman, MNDuffy, KJ 3-(1,1-dioxo-2H-(1,2,4)-benzothiadiazin-3-yl)-4-hydroxy-2(1H)-quinolinones, potent inhibitors of hepatitis C virus RNA-dependent RNA polymerase. J Med Chem 49:971-83 (2006)  
Target
Name:
RNA-directed RNA polymerase
Synonyms:
Hepatitis C virus NS5B RNA-dependent RNA polymerase | NS5B protein
Type:
Protein
Mol. Mass.:
25173.95
Organism:
Hepatitis C virus
Description:
Q8JXU8
Residue:
229
  
Inhibitor
Name:
BDBM50181580
Synonyms:
1-(3,3-dimethylbutyl)-3-(1,1-dioxo-1,4-dihydrobenzo[1,2,4]thiadiazin-3-yl)-4-hydroxy-6-(2-hydroxyethylamino)-1H-quinolin-2-one | CHEMBL202595
Type:
Small organic molecule
Emp. Form.:
C24H28N4O5S
Mol. Mass.:
484.568
SMILES:
CC(C)(C)CCn1c2ccc(NCCO)cc2c(O)c(C2=Nc3ccccc3S(=O)(=O)N2)c1=O
: