Target
Beta-1 adrenergic receptor
Ligand
BDBM50601551
Substrate
Meas. Tech.
ChEMBL_2237599 (CHEMBL5151495)
Kd
0.075000±n/a nM
Citation
 Tropmann, KBresinsky, MForster, LMönnich, DBuschauer, AWittmann, HJHübner, HGmeiner, PPockes, SStrasser, A Abolishing Dopamine D J Med Chem 64:8684-8709 (2021) Target
Name:
Beta-1 adrenergic receptor
Synonyms:
ADRB1 ADRB1_HUMAN Beta-1 adrenoceptor adrenergic Beta1
Type:
G Protein-Coupled Receptor (GPCR)
Mol. Mass.:
51338.40
Organism:
Homo sapiens (Human)
Description:
P08588
Residue:
477
  
Inhibitor
Name:
BDBM50601551
Synonyms:
CHEMBL5207281
Type:
Small organic molecule
Emp. Form.:
C16H25F6N7O5S
Mol. Mass.:
541.469
SMILES:
OC(=O)C(F)(F)F.OC(=O)C(F)(F)F.CCCCCNC(=O)\N=C(/N)NCCCc1nnc(N)s1
: