Target
Poly [ADP-ribose] polymerase 1
Ligand
BDBM27708
Substrate
Meas. Tech.
ChEMBL_2238132 (CHEMBL5152028)
IC50
65±n/a nM
Citation
Target
Name:
Poly [ADP-ribose] polymerase 1
Synonyms:
(ARTD1 or PARP1) 2.4.2.30 ADPRT ARTD1 Human diphtheria toxin-like ADP-ribosyltransferase (ARTD1 or PARP1) NT-PARP-1 PARP1 PPOL Poly [ADP-ribose] polymerase 1 (PARP) Poly [ADP-ribose] polymerase 1 (PARP1) Poly [ADP-ribose] polymerase 1, 28-kDa form Poly [ADP-ribose] polymerase 1, processed C-terminus Poly [ADP-ribose] polymerase-1 Poly(ADP-ribose) polymerase-1 (ARTD1/PARP1) Protein poly-ADP-ribosyltransferase PARP1 | Synonyms=ADPRT
Type:
Mol. Mass.:
113114.22
Organism:
Homo sapiens (Human)
Description:
P09874
Residue:
1014
  
Inhibitor
Name:
BDBM27708
Synonyms:
8-chloro-2-{3-[4-(4-fluorophenyl)-1,2,3,6-tetrahydropyridin-1-yl]propyl}-3,4-dihydroquinazolin-4-one quinazolinone analogue, 1d
Type:
Small organic molecule
Emp. Form.:
C22H21ClFN3O
Mol. Mass.:
397.873
SMILES:
Fc1ccc(cc1)C1=CCN(CCCc2nc3c(Cl)cccc3c(=O)[nH]2)CC1
: