Target
Potassium voltage-gated channel subfamily H member 2
Ligand
BDBM27708
Substrate
Meas. Tech.
ChEMBL_2238137 (CHEMBL5152033)
IC50
2600±n/a nM
Citation
Target
Name:
Potassium voltage-gated channel subfamily H member 2
Synonyms:
1,3-beta-glucan synthase component GLS2 ERG Eag-related protein 1 Ether-a-go-go-related gene (HERG) Ether-a-go-go-related gene potassium channel 1 Ether-a-go-go-related gene potassium channel 1 (hERG1) Ether-a-go-go-related protein 1 H-ERG KCNH2 Potassium voltage-gated channel subfamily H member 2 (hERG) Voltage-gated potassium channel subunit Kv11.1 hERG Potassium Channel 1 | putative potassium channel subunit
Type:
Multi-pass membrane protein
Mol. Mass.:
126672.65
Organism:
Homo sapiens (Human)
Description:
Q12809
Residue:
1159
  
Inhibitor
Name:
BDBM27708
Synonyms:
8-chloro-2-{3-[4-(4-fluorophenyl)-1,2,3,6-tetrahydropyridin-1-yl]propyl}-3,4-dihydroquinazolin-4-one quinazolinone analogue, 1d
Type:
Small organic molecule
Emp. Form.:
C22H21ClFN3O
Mol. Mass.:
397.873
SMILES:
Fc1ccc(cc1)C1=CCN(CCCc2nc3c(Cl)cccc3c(=O)[nH]2)CC1
: