Target
Adenosine receptor A3
Ligand
BDBM50182320
Substrate
Meas. Tech.
ChEMBL_349357 (CHEMBL865062)
Ki
59±n/a nM
Citation
 DeNinno, MPMasamune, HChenard, LKDiRico, KJEller, CEtienne, JBTickner, JEKennedy, SPKnight, DRKong, JOleynek, JJTracey, WRHill, RJ The synthesis of highly potent, selective, and water-soluble agonists at the human adenosine A3 receptor. Bioorg Med Chem Lett 16:2525-7 (2006)  
Target
Name:
Adenosine receptor A3
Synonyms:
A3 adenosine receptor (hA3) ADORA3 | Adenosine A3 receptor (A3AR)
Type:
G Protein-Coupled Receptor (GPCR)
Mol. Mass.:
36197.32
Organism:
Homo sapiens (Human)
Description:
P0DMS8
Residue:
318
  
Inhibitor
Name:
BDBM50182320
Synonyms:
(2S,4R,5R)-4-hydroxy-N-methyl-5-(6-(methylamino)-9H-purin-9-yl)-tetrahydrofuran-2-carboxamide | CHEMBL382046
Type:
Small organic molecule
Emp. Form.:
C12H16N6O3
Mol. Mass.:
292.2938
SMILES:
CNC(=O)[C@@H]1C[C@@H](O)[C@@H](O1)n1cnc2c(NC)ncnc12
: