Target
Adenosine receptor A3
Ligand
BDBM50182321
Substrate
Meas. Tech.
ChEMBL_349357 (CHEMBL865062)
Ki
16±n/a nM
Citation
 DeNinno, MPMasamune, HChenard, LKDiRico, KJEller, CEtienne, JBTickner, JEKennedy, SPKnight, DRKong, JOleynek, JJTracey, WRHill, RJ The synthesis of highly potent, selective, and water-soluble agonists at the human adenosine A3 receptor. Bioorg Med Chem Lett 16:2525-7 (2006)  
Target
Name:
Adenosine receptor A3
Synonyms:
A3 adenosine receptor (hA3) ADORA3 | Adenosine A3 receptor (A3AR)
Type:
G Protein-Coupled Receptor (GPCR)
Mol. Mass.:
36197.32
Organism:
Homo sapiens (Human)
Description:
P0DMS8
Residue:
318
  
Inhibitor
Name:
BDBM50182321
Synonyms:
(2S,3S,4R,5R)-5-(6-(2-(benzyloxy)-5-chlorobenzylamino)-9H-purin-9-yl)-3-amino-4-hydroxy-N-methyl-tetrahydrofuran-2-carboxamide | CHEMBL378430
Type:
Small organic molecule
Emp. Form.:
C25H26ClN7O4
Mol. Mass.:
523.971
SMILES:
CNC(=O)[C@H]1O[C@H]([C@H](O)[C@@H]1N)n1cnc2c(NCc3cc(Cl)ccc3OCc3ccccc3)ncnc12
: