Target
Adenosine receptor A3
Ligand
BDBM50122930
Substrate
Meas. Tech.
ChEMBL_349357 (CHEMBL865062)
Ki
120±n/a nM
Citation
 DeNinno, MPMasamune, HChenard, LKDiRico, KJEller, CEtienne, JBTickner, JEKennedy, SPKnight, DRKong, JOleynek, JJTracey, WRHill, RJ The synthesis of highly potent, selective, and water-soluble agonists at the human adenosine A3 receptor. Bioorg Med Chem Lett 16:2525-7 (2006)  
Target
Name:
Adenosine receptor A3
Synonyms:
A3 adenosine receptor (hA3) ADORA3 | Adenosine A3 receptor (A3AR)
Type:
G Protein-Coupled Receptor (GPCR)
Mol. Mass.:
36197.32
Organism:
Homo sapiens (Human)
Description:
P0DMS8
Residue:
318
  
Inhibitor
Name:
BDBM50122930
Synonyms:
(2S,3S,4R,5R)-3-amino-4-hydroxy-N-methyl-5-(6-(methylamino)-9H-purin-9-yl)-tetrahydrofuran-2-carboxamide CHEMBL118507
Type:
Small organic molecule
Emp. Form.:
C12H17N7O3
Mol. Mass.:
307.3085
SMILES:
CNC(=O)[C@H]1O[C@H]([C@H](O)[C@@H]1N)n1cnc2c(NC)ncnc12
: