Target
Matrix metalloproteinase-14
Ligand
BDBM50182403
Substrate
Meas. Tech.
ChEMBL_350096 (CHEMBL865077)
Ki
1200±n/a nM
Citation
 Thompson, LALiauw, AYRamanjulu, MMKasireddy-Polam, PMercer, SEMaduskuie, TPGlicksman, MRoach, AHMeredith, JELiu, RQCombs, APHigaki, JNCordell, BSeiffert, DZaczek, RCRobertson, DWOlson, RE Synthesis and evaluation of succinoyl-caprolactam gamma-secretase inhibitors. Bioorg Med Chem Lett 16:2357-63 (2006)  
Target
Name:
Matrix metalloproteinase-14
Synonyms:
MMP-14 MMP14 MT-MMP 1 MT1MMP Matrix Metalloproteinase-14 (MMP-14) Matrix metalloproteinase-14 Membrane-type matrix metalloproteinase 1 | Membrane-type-1 matrix metalloproteinase
Type:
Protein
Mol. Mass.:
65900.19
Organism:
Homo sapiens (Human)
Description:
P50281
Residue:
582
  
Inhibitor
Name:
BDBM50182403
Synonyms:
(2R,3S)-N1-((S)-1-(3-phenoxybenzyl)-2-oxoazepan-3-yl)-N4-hydroxy-2-isobutyl-3-propylsuccinamide CHEMBL204357 | SR-973
Type:
Small organic molecule
Emp. Form.:
C30H41N3O5
Mol. Mass.:
523.6636
SMILES:
CCC[C@@H]([C@@H](CC(C)C)C(=O)N[C@H]1CCCCN(Cc2cccc(Oc3ccccc3)c2)C1=O)C(=O)NO
: