Target
Amyloid-beta precursor protein
Ligand
BDBM50410862
Substrate
Meas. Tech.
ChEMBL_350088 (CHEMBL865069)
IC50
6000±n/a nM
Citation
 Thompson, LALiauw, AYRamanjulu, MMKasireddy-Polam, PMercer, SEMaduskuie, TPGlicksman, MRoach, AHMeredith, JELiu, RQCombs, APHigaki, JNCordell, BSeiffert, DZaczek, RCRobertson, DWOlson, RE Synthesis and evaluation of succinoyl-caprolactam gamma-secretase inhibitors. Bioorg Med Chem Lett 16:2357-63 (2006)  
Target
Name:
Amyloid-beta precursor protein
Synonyms:
A4 ABPP AICD-50 AICD-59 AID(57) APP Alzheimer disease amyloid protein Amyloid beta Protein Amyloid beta protein Abeta(1-42) Amyloid intracellular domain 57 Amyloid protein (Abeta42b) Beta amyloid A4 protein Beta-APP42 Beta-amyloid protein 42 C83 CVAP Gamma Secretase Gamma-CTF(57) Gamma-secretase Gamma-secretase C-terminal fragment 57 P3(40) PN-II Protease nexin-II S-APP-beta Soluble APP-beta | beta-Amyloid Precursor Protein (APP)
Type:
Single-pass type I membrane protein
Mol. Mass.:
86890.41
Organism:
Homo sapiens (Human)
Description:
P05067
Residue:
770
  
Inhibitor
Name:
BDBM50410862
Synonyms:
CHEMBL381336
Type:
Small organic molecule
Emp. Form.:
C35H49N3O4
Mol. Mass.:
575.7813
SMILES:
CCC[C@@H]([C@@H](CC(C)C)C(=O)N[C@H]1CCCCN(Cc2cccc(Oc3ccccc3)c2)C1=O)C(=O)NC1CCCC1
: