Target
C-C chemokine receptor type 4
Ligand
BDBM50183105
Substrate
Meas. Tech.
ChEMBL_350559 (CHEMBL870148)
IC50
5500±n/a nM
Citation
 Wang, XXu, FXu, QMahmud, HHouze, JZhu, LAkerman, MTonn, GTang, LMcMaster, BEDairaghi, DJSchall, TJCollins, TLMedina, JC Optimization of 2-aminothiazole derivatives as CCR4 antagonists. Bioorg Med Chem Lett 16:2800-3 (2006)  
Target
Name:
C-C chemokine receptor type 4
Synonyms:
C-C CKR-4 C-C chemokine receptor type 4 (CCR4) CCR-4 CCR4_HUMAN CMKBR4 | K5-5
Type:
Enzyme
Mol. Mass.:
41406.41
Organism:
Homo sapiens (Human)
Description:
P51679
Residue:
360
  
Inhibitor
Name:
BDBM50183105
Synonyms:
CHEMBL208452 | N-(naphthalen-1-yl)-4-phenylthiazol-2-amine
Type:
Small organic molecule
Emp. Form.:
C19H14N2S
Mol. Mass.:
302.393
SMILES:
N(c1nc(cs1)-c1ccccc1)c1cccc2ccccc12
: