Target
Replicase polyprotein 1ab
Ligand
BDBM50058655
Substrate
Meas. Tech.
ChEMBL_2241977 (CHEMBL5156187)
IC50
1040±n/a nM
Citation
 Zhang, JWXiong, YWang, FZhang, FMYang, XLin, GQTian, PGe, GGao, D Discovery of 9,10-dihydrophenanthrene derivatives as SARS-CoV-2 3CL Eur J Med Chem 228:0 (2022) Target
Name:
Replicase polyprotein 1ab
Synonyms:
ORF1ab polyprotein pp1ab | rep
Type:
Protein
Mol. Mass.:
794070.71
Organism:
2019-nCoV
Description:
P0DTD1
Residue:
7096
  
Inhibitor
Name:
BDBM50058655
Synonyms:
1,1',1'',1'''-[disulfanediylbis(carbonothioylnitrilo)]tetraethane Antabuse (TN) DISULFIRAM N,N,N',N'-tetraethylthiuram disulfide US11753371, Compound II-2a-(Disulfiram) bis(diethylthiocarbamoyl) disulfide med.21724, Compound 151 tetraethylthiuram disulfide | tetraethylthiuram disulphide
Type:
Small organic molecule
Emp. Form.:
C10H20N2S4
Mol. Mass.:
296.539
SMILES:
CCN(CC)C(=S)SSC(=S)N(CC)CC
: