Target
Cannabinoid receptor 2
Ligand
BDBM22988
Substrate
Meas. Tech.
ChEMBL_342813 (CHEMBL868884)
Ki
180±n/a nM
Citation
 Appendino, GMinassi, ABerton, LMoriello, ASCascio, MGDe Petrocellis, LDi Marzo, V Oxyhomologues of anandamide and related endolipids: chemoselective synthesis and biological activity. J Med Chem 49:2333-8 (2006)  
Target
Name:
Cannabinoid receptor 2
Synonyms:
CANNABINOID CB2 CB2 CB2B CNR2_HUMAN Cannabinoid CB2 receptor Cannabinoid receptor 2 (CB2R) | hCB2
Type:
G Protein-Coupled Receptor (GPCR)
Mol. Mass.:
39690.94
Organism:
Homo sapiens (Human)
Description:
P34972
Residue:
360
  
Inhibitor
Name:
BDBM22988
Synonyms:
(5Z,8Z,11Z,14Z)-N-(2-hydroxyethyl)icosa-5,8,11,14-tetraenamide ANANDAMIDE Arachidonoyl ethanolamide (AEA) Arachidonylethanolamide [14C]Anandamide | [3H]Anandamide
Type:
radiolabeled substrate
Emp. Form.:
C22H37NO2
Mol. Mass.:
347.5347
SMILES:
CCCCC\C=C/C\C=C/C\C=C/C\C=C/CCCC(=O)NCCO
: