Target
ALK tyrosine kinase receptor/Nucleophosmin
Ligand
BDBM4078
Substrate
Meas. Tech.
ChEMBL_343256 (CHEMBL861015)
IC50
>40000±n/a nM
Citation
 Cozza, GBonvini, PZorzi, EPoletto, GPagano, MASarno, SDonella-Deana, AZagotto, GRosolen, APinna, LAMeggio, FMoro, S Identification of ellagic acid as potent inhibitor of protein kinase CK2: a successful example of a virtual screening application. J Med Chem 49:2363-6 (2006)  
Target
Name:
ALK tyrosine kinase receptor/Nucleophosmin
Synonyms:
NPM/ALK (Nucleophosmin/ALK tyrosine kinase receptor)
Type:
Mol. Mass.:
Description:
ASSAY_ID of EBI is 331455
Components:
This complex has 2 components.
Component 1
Name:
ALK tyrosine kinase receptor
Synonyms:
ALK ALK_HUMAN CD_antigen: CD246
Type:
Protein
Mol. Mass.:
176453.10
Organism:
Homo sapiens (Human)
Description:
Q9UM73
Residue:
1620
  
Component 2
Name:
Nucleophosmin
Synonyms:
NPM NPM1 | NPM_HUMAN
Type:
PROTEIN
Mol. Mass.:
32552.99
Organism:
Homo sapiens (Human)
Description:
ChEMBL_1502715
Residue:
294
  
Component 3
Name:
ALK tyrosine kinase receptor
Synonyms:
ALK ALK_HUMAN CD_antigen: CD246
Type:
Protein
Mol. Mass.:
176453.10
Organism:
Homo sapiens (Human)
Description:
Q9UM73
Residue:
1620
  
Inhibitor
Name:
BDBM4078
Synonyms:
6,7,13,14-tetrahydroxy-2,9-dioxatetracyclo[6.6.2.0^{4,16}.0^{11,15}]hexadeca-1(14),4(16),5,7,11(15),12-hexaene-3,10-dione ELLAGIC ACID Ellagic acid (18) MLS000069632 cid_5281855
Type:
Small organic molecule
Emp. Form.:
C14H6O8
Mol. Mass.:
302.1926
SMILES:
Oc1cc2c3c(oc(=O)c4cc(O)c(O)c(oc2=O)c34)c1O
: