Target
Cholinesterase
Ligand
BDBM50604405
Substrate
Meas. Tech.
ChEMBL_2247724 (CHEMBL5161934)
Ki
0.180000±n/a nM
Citation
 Meden, AKnez, DBrazzolotto, XNachon, FDias, JSvete, JStojan, JGro?elj, UGobec, S From tryptophan-based amides to tertiary amines: Optimization of a butyrylcholinesterase inhibitor series. Eur J Med Chem 234:0 (2022) Target
Name:
Cholinesterase
Synonyms:
Acylcholine acylhydrolase Butyrylcholine esterase (BChE) Butyrylcholinesterase (BuChE) CHLE_HUMAN Cholinesterases Pseudocholinesterase
Type:
Homotetramer
Mol. Mass.:
68422.27
Organism:
Homo sapiens (Human)
Description:
P06276
Residue:
602
  
Inhibitor
Name:
BDBM50604405
Synonyms:
CHEMBL5186889
Type:
Small organic molecule
Emp. Form.:
C27H42N2O2
Mol. Mass.:
426.6346
SMILES:
CCCCN(CCC1CCCCCC1)CCc1c[nH]c2c(OC(=O)C(C)C)cccc12
: